{"text_format":"1","workbook":"xlsx","n_sheets":6,"sheets":["Frontpage🛠️","Project estimate💰","Project Estimate Breakdown💰","Project estimate - Description","Language","Currency"],"not_rendered":{"charts":0,"images":2,"macros":1,"external_links":0,"defined_names":8,"comments":0,"pivot_tables":0},"unopened":[],"bounds":{"document_bytes":16777216,"sheet_cells":100000,"rows_first":2000,"rows_last":500,"rows_between":2000,"halvings":0,"cell_chars":16384,"cell_head_chars":4096},"cells_cut":0,"cells_raw":0,"read":"whole","date_system":"1900"}

{"sheet":"Frontpage🛠️","index":0,"n_rows":15,"n_cols":4,"rows_kept":15,"cut":false,"hidden":false,"merged":[[12,3,12,4],[3,2,8,6],[11,3,11,4],[13,3,13,4]]}
[]
[null,null,"Calculator"]
[null,null,"SERVICE"]
[null,null,"Service calculator is tool to help estimate Service deliverables. \nEstimat is based on best practices, but service deliverbles need to be verified by consultancy department before offer is sent to customer.\n\nIf you have questions or in need for help, please contact your Sales Manager or local NSR."]
[]
[]
[]
[]
[]
[]
[null,null,"Choose your settings"]
[null,null,"Select language","NO"]
[null,null,"Select currency","Norway"]
[null,null,"Select rate type","Normal"]
[null,null,null,"Rate currently only available for Norway"]

{"sheet":"Project estimate💰","index":1,"n_rows":67,"n_cols":19,"rows_kept":67,"cut":false,"hidden":false,"merged":[]}
[]
[null,"PROJECT"]
[null,"ESTIMATION"]
[null,"01","IDENTIFY",{"$f":"Language!$C$12","v":"Gjennomføringer"},{"$f":"Language!$C$13","v":"Konsulenter"},{"$f":"Language!$C$14","v":"Forberedelser"},{"$f":"Language!$C$15","v":"Gjennomføring"},{"$f":"Language!$C$16","v":"Etterarbeid"},{"$f":"Language!$C$17","v":"Forberedelser - Total"},{"$f":"Language!$C$18","v":"Gjennomføring - Total"},{"$f":"Language!$C$19","v":"Etterarbeid - Total"},{"$f":"Language!$C$20","v":"Tid - Total"},{"$f":"Language!$C$21","v":"Kostnad - Forberedelser"},{"$f":"Language!$C$22","v":"Kostnad - Gjennomføring"},{"$f":"Language!$C$23","v":"Kostnad - Etterarbeid"},{"$f":"Language!$C$24","v":"Kostnad - Total"},null,null,{"$f":"Language!$C$25","v":"Aktivitet - Beskrivelse"}]
[null,"ID01",{"$f":"VLOOKUP(B5,Language!$B$27:$C$118,2,FALSE)","v":"Løsningsbeskrivelse"},0,2,4,3,4,{"$f":"$D5*F5","v":0},{"$f":"$D5*E5*G5","v":0},{"$f":"$D5*H5","v":0},{"$f":"SUM(I5:K5)","v":0},{"$f":"(D5*F5*PricePerHour)","v":0},{"$f":"(D5*E5*G5*PricePerHour)","v":0},{"$f":"D5*H5*PricePerHour","v":0},{"$f":"SUM(M5:O5)","v":0},null,null,{"$f":"VLOOKUP(B5,Language!$B$27:$D$118,3,FALSE)","v":0}]
[null,"ID00","Custom activity",0,0,0,0,0,{"$f":"$D6*F6","v":0},{"$f":"$D6*E6*G6","v":0},{"$f":"$D6*H6","v":0},0,{"$f":"(D6*F6*PricePerHour)","v":0},{"$f":"(D6*E6*G6*PricePerHour)","v":0},{"$f":"D6*H6*PricePerHour","v":0},{"$f":"SUM(M6:O6)","v":0}]
[null,"ID00","Custom activity",0,0,0,0,0,0,0,0,{"$f":"SUM(I7:K7)","v":0},{"$f":"(D7*F7*PricePerHour)","v":0},{"$f":"(D7*E7*G7*PricePerHour)","v":0},{"$f":"D7*H7*PricePerHour","v":0},0]
[null,null,"Phase summary",{"$f":"SUM(D5:D7)","v":0},null,null,null,null,{"$f":"SUM(I5:I7)","v":0},{"$f":"SUM(J5:J7)","v":0},0,0,{"$f":"SUM(M5:M7)","v":0},{"$f":"SUM(N5:N7)","v":0},{"$f":"SUM(O5:O7)","v":0},{"$f":"SUM(P5:P7)","v":0}]
[null,"02","INITIATE",{"$f":"Language!$C$12","v":"Gjennomføringer"},{"$f":"Language!$C$13","v":"Konsulenter"},{"$f":"Language!$C$14","v":"Forberedelser"},{"$f":"Language!$C$15","v":"Gjennomføring"},{"$f":"Language!$C$16","v":"Etterarbeid"},{"$f":"Language!$C$17","v":"Forberedelser - Total"},{"$f":"Language!$C$18","v":"Gjennomføring - Total"},{"$f":"Language!$C$19","v":"Etterarbeid - Total"},{"$f":"Language!$C$20","v":"Tid - Total"},{"$f":"Language!$C$21","v":"Kostnad - Forberedelser"},{"$f":"Language!$C$22","v":"Kostnad - Gjennomføring"},{"$f":"Language!$C$23","v":"Kostnad - Etterarbeid"},{"$f":"Language!$C$24","v":"Kostnad - Total"},null,null,{"$f":"Language!$C$25","v":"Aktivitet - Beskrivelse"}]
[null,"IN01",{"$f":"VLOOKUP(B10,Language!$B$27:$C$118,2,FALSE)","v":"Verdi workshop"},0,2,4,3,4,{"$f":"$D10*F10","v":0},{"$f":"$D10*E10*G10","v":0},{"$f":"$D10*H10","v":0},{"$f":"SUM(I10:K10)","v":0},{"$f":"(D10*F10*PricePerHour)","v":0},{"$f":"(D10*E10*G10*PricePerHour)","v":0},{"$f":"D10*H10*PricePerHour","v":0},{"$f":"SUM(M10:O10)","v":0},null,null,{"$f":"VLOOKUP(B10,Language!$B$27:$D$118,3,FALSE)","v":"Skape enighet om hvorfor vi gjør dette og hvordan dette støtter strategien. Opparbeide en felles forståelse for og sterk forankring av prosjektets omfang og leveranser i ledergruppen. Kartlegge de 3-5 viktigste KPIer som forretningen navigerer og prioriterer etter."}]
[null,"IN02",{"$f":"VLOOKUP(B11,Language!$B$27:$C$118,2,FALSE)","v":"Kick-Off møte"},1,1,2,2,2,{"$f":"$D11*F11","v":2},{"$f":"$D11*E11*G11","v":2},{"$f":"$D11*H11","v":2},{"$f":"SUM(I11:K11)","v":6},{"$f":"(D11*F11*PricePerHour)","v":3110},{"$f":"(D11*E11*G11*PricePerHour)","v":3110},{"$f":"D11*H11*PricePerHour","v":3110},{"$f":"SUM(M11:O11)","v":9330},null,null,{"$f":"VLOOKUP(B11,Language!$B$27:$D$118,3,FALSE)","v":"Skape felles forståelse av prosjektets omfang, leveranser og nøkkel KPI. Definere organisering av prosjektet og mobilisere kjerneteam.Forberede designfasen (Hva trenger vi fra de - hvem ønsker vi at skal delta)."}]
[null,"IN00","Custom activity",0,0,0,0,0,0,0,0,0,{"$f":"(D12*F12*PricePerHour)","v":0},{"$f":"(D12*E12*G12*PricePerHour)","v":0},{"$f":"D12*H12*PricePerHour","v":0},0]
[null,"IN00","Custom activity",0,0,0,0,0,0,0,0,0,{"$f":"(D13*F13*PricePerHour)","v":0},{"$f":"(D13*E13*G13*PricePerHour)","v":0},{"$f":"D13*H13*PricePerHour","v":0},0]
[null,null,"Phase summary",{"$f":"SUM(D10:D13)","v":1},null,null,null,null,{"$f":"SUM(I10:I13)","v":2},{"$f":"SUM(J10:J13)","v":2},2,6,{"$f":"SUM(M10:M13)","v":3110},{"$f":"SUM(N10:N13)","v":3110},{"$f":"SUM(O10:O13)","v":3110},{"$f":"SUM(P10:P13)","v":9330}]
[null,"03","DESIGN",{"$f":"Language!$C$12","v":"Gjennomføringer"},{"$f":"Language!$C$13","v":"Konsulenter"},{"$f":"Language!$C$14","v":"Forberedelser"},{"$f":"Language!$C$15","v":"Gjennomføring"},{"$f":"Language!$C$16","v":"Etterarbeid"},{"$f":"Language!$C$17","v":"Forberedelser - Total"},{"$f":"Language!$C$18","v":"Gjennomføring - Total"},{"$f":"Language!$C$19","v":"Etterarbeid - Total"},{"$f":"Language!$C$20","v":"Tid - Total"},{"$f":"Language!$C$21","v":"Kostnad - Forberedelser"},{"$f":"Language!$C$22","v":"Kostnad - Gjennomføring"},{"$f":"Language!$C$23","v":"Kostnad - Etterarbeid"},{"$f":"Language!$C$24","v":"Kostnad - Total"},null,null,{"$f":"Language!$C$25","v":"Aktivitet - Beskrivelse"}]
[null,"DE01",{"$f":"VLOOKUP(B16,Language!$B$27:$C$118,2,FALSE)","v":"KPI workshop"},1,2,8,4,0,{"$f":"$D16*F16","v":8},{"$f":"$D16*E16*G16","v":8},{"$f":"$D16*H16","v":0},{"$f":"SUM(I16:K16)","v":16},{"$f":"(D16*F16*PricePerHour)","v":12440},{"$f":"(D16*E16*G16*PricePerHour)","v":12440},{"$f":"D16*H16*PricePerHour","v":0},{"$f":"SUM(M16:O16)","v":24880},null,null,{"$f":"VLOOKUP(B16,Language!$B$27:$D$118,3,FALSE)","v":"Omsette de viktigste måleparameter til leading og lagging KPIer. Kvalifisere KPI, hvordan omsetter vi dette til SO og kan vi måle og følge opp dette. Hvilke dashboards trenger vi for å kunne omsette data til innsikt. Hvem er ansvarlig for datainnsamling, kvalifisering og SO hos kunden."}]
[null,"DE02",{"$f":"VLOOKUP(B17,Language!$B$27:$C$118,2,FALSE)","v":"Arbeidsflyt workshop"},1,2,8,4,4,{"$f":"$D17*F17","v":8},8,4,20,12440,12440,6220,{"$f":"SUM(M17:O17)","v":31100},null,null,{"$f":"VLOOKUP(B17,Language!$B$27:$D$118,3,FALSE)","v":"Forberede designfasen (Hva trenger vi fra de - hvem ønsker vi at skal delta)."}]
[null,"DE03",{"$f":"VLOOKUP(B18,Language!$B$27:$C$118,2,FALSE)","v":"Konfigurasjonsworkshop"},1,1,8,4,0,8,4,0,12,12440,6220,0,18660,null,null,{"$f":"VLOOKUP(B18,Language!$B$27:$D$118,3,FALSE)","v":"Workshop med 2 konsulenter fasilitert digitalt via Miro eller fysisk etter Brown Paper metoden. Formålet med workshopen er å komme frem til en best mulig utforming og konfigurasjon for SuperOffice CRM. Vi fokuserer på at systemet må støtte forretningsprosessen (definert i Workflow workshop) og dekke behovet for brukerstøtte og rapportering i organisasjonen. Databasen konfigureres og alt dokumenteres."}]
[null,"DE04",{"$f":"VLOOKUP(B19,Language!$B$27:$C$118,2,FALSE)","v":"CRM Script spesifikasjon"},0,1,0,2,2,0,0,0,0,0,0,0,0,null,null,{"$f":"VLOOKUP(B19,Language!$B$27:$D$118,3,FALSE)","v":"Formålet med CRMScript-workshopen er at vi sammen avdekker deres behov for automatisering av prosesser, for å sikre datakvalitet og for spesialtilpassing av SuperOffice. Utvikling av script estimeres på bakgrunn av denne aktiviteten. "}]
[null,"DE05",{"$f":"VLOOKUP(B20,Language!$B$27:$C$118,2,FALSE)","v":"Importspesifikasjon"},0,1,0,4,4,0,0,0,0,0,0,0,0,null,null,{"$f":"VLOOKUP(B20,Language!$B$27:$D$118,3,FALSE)","v":"Et arbeidsmøte hvor man går igjennom importbehovene. Formålet er en oversikt over hvilke felt som skal importeres og hvor disse skal synliggjøres i SuperOffice. Gjennomføring av selve importen estimeres på bakgrunn av denne aktiviteten. "}]
{"$rows_left_out":48}
{"sheet":"Project Estimate Breakdown💰","index":2,"n_rows":67,"n_cols":9,"rows_kept":67,"cut":false,"hidden":false,"merged":[]}
[]
[]
[null,"PROJECT"]
[null,"ESTIMATE",null,null,null,null,null,null,"EXECUTIONS\n(Used for show/hide row)"]
[null,null,"IDENTIFY",{"$f":"IF('Project estimate💰'!L8=0,\"0\",'Project estimate💰'!L8&\" \"&Duration)","v":"0"},{"$f":"Currency&\" \"&TEXT('Project estimate💰'!P8,\"#\\ ##0\")","v":"NOK  0"},null,{"$f":"Language!$C$11","v":"MØTETID MED KUNDE"},null,{"$f":"SUM(I6:I8)","v":0}]
[null,null,{"$f":"'Project estimate💰'!C5","v":"Løsningsbeskrivelse"},{"$f":"IF('Project estimate💰'!L5=0,IF('Project estimate💰'!D5>0,\"TBA\",'Project estimate💰'!L5),'Project estimate💰'!L5&\" \"&Duration)","v":0},{"$f":"Currency&\" \"&TEXT('Project estimate💰'!P5,\"#\\ ##0\")","v":"NOK  0"},null,{"$f":"IF('Project estimate💰'!D5=0,\" \",'Project estimate💰'!G5*'Project estimate💰'!D5&\" \"& Duration)","v":" "},null,{"$f":"IF('Project estimate💰'!D5=0,\"0\",'Project estimate💰'!D5)","v":"0"}]
[null,null,{"$f":"'Project estimate💰'!C6","v":"Custom activity"},{"$f":"IF('Project estimate💰'!L6=0,\"0\",'Project estimate💰'!L6&\" \"&Duration)","v":"0"},{"$f":"Currency&\" \"&TEXT('Project estimate💰'!P6,\"#\\ ##0\")","v":"NOK  0"},null,{"$f":"IF('Project estimate💰'!D6=0,\" \",'Project estimate💰'!G6*'Project estimate💰'!D6&\" \"& Duration)","v":" "},null,{"$f":"IF('Project estimate💰'!D6=0,\"0\",'Project estimate💰'!D6)","v":"0"}]
[null,null,{"$f":"'Project estimate💰'!C7","v":"Custom activity"},{"$f":"IF('Project estimate💰'!L7=0,\"0\",'Project estimate💰'!L7&\" \"&Duration)","v":"0"},{"$f":"Currency&\" \"&TEXT('Project estimate💰'!P7,\"#\\ ##0\")","v":"NOK  0"},null,{"$f":"IF('Project estimate💰'!D7=0,\" \",'Project estimate💰'!G7*'Project estimate💰'!D7&\" \"& Duration)","v":" "},null,{"$f":"IF('Project estimate💰'!D7=0,\"0\",'Project estimate💰'!D7)","v":"0"}]
[]
[null,null,"INITIATE",{"$f":"IF('Project estimate💰'!L14=0,\"0\",'Project estimate💰'!L14&\" \"&Duration)","v":"6 TIMER"},{"$f":"Currency&\" \"&TEXT('Project estimate💰'!P14,\"#\\ ##0\")","v":"NOK 9 330"},null,{"$f":"Language!$C$11","v":"MØTETID MED KUNDE"},null,{"$f":"SUM(I11:I14)","v":1}]
[null,null,{"$f":"'Project estimate💰'!C10","v":"Verdi workshop"},{"$f":"IF('Project estimate💰'!L10=0,\"0\",'Project estimate💰'!L10&\" \"&Duration)","v":"0"},{"$f":"Currency&\" \"&TEXT('Project estimate💰'!P10,\"#\\ ##0\")","v":"NOK  0"},null,{"$f":"IF('Project estimate💰'!D10=0,\" \",'Project estimate💰'!G10*'Project estimate💰'!D10&\" \"& Duration)","v":" "},null,{"$f":"IF('Project estimate💰'!D10=0,\"0\",'Project estimate💰'!D10)","v":"0"}]
[null,null,{"$f":"'Project estimate💰'!C11","v":"Kick-Off møte"},{"$f":"IF('Project estimate💰'!L11=0,\"0\",'Project estimate💰'!L11&\" \"&Duration)","v":"6 TIMER"},{"$f":"Currency&\" \"&TEXT('Project estimate💰'!P11,\"#\\ ##0\")","v":"NOK 9 330"},null,{"$f":"IF('Project estimate💰'!D11=0,\" \",'Project estimate💰'!G11*'Project estimate💰'!D11&\" \"& Duration)","v":"2 TIMER"},null,{"$f":"IF('Project estimate💰'!D11=0,\"0\",'Project estimate💰'!D11)","v":1}]
[null,null,{"$f":"'Project estimate💰'!C12","v":"Custom activity"},{"$f":"IF('Project estimate💰'!L12=0,\"0\",'Project estimate💰'!L12&\" \"&Duration)","v":"0"},{"$f":"Currency&\" \"&TEXT('Project estimate💰'!P12,\"#\\ ##0\")","v":"NOK  0"},null,{"$f":"IF('Project estimate💰'!D12=0,\" \",'Project estimate💰'!G12*'Project estimate💰'!D12&\" \"& Duration)","v":" "},null,{"$f":"IF('Project estimate💰'!D12=0,\"0\",'Project estimate💰'!D12)","v":"0"}]
[null,null,{"$f":"'Project estimate💰'!C13","v":"Custom activity"},{"$f":"IF('Project estimate💰'!L13=0,\"0\",'Project estimate💰'!L13&\" \"&Duration)","v":"0"},{"$f":"Currency&\" \"&TEXT('Project estimate💰'!P13,\"#\\ ##0\")","v":"NOK  0"},null,{"$f":"IF('Project estimate💰'!D13=0,\" \",'Project estimate💰'!G13*'Project estimate💰'!D13&\" \"& Duration)","v":" "},null,{"$f":"IF('Project estimate💰'!D13=0,\"0\",'Project estimate💰'!D13)","v":"0"}]
[]
[null,null,"DESIGN",{"$f":"IF('Project estimate💰'!L28=0,\"0\",'Project estimate💰'!L28&\" \"&Duration)","v":"52 TIMER"},{"$f":"Currency&\" \"&TEXT('Project estimate💰'!P28,\"#\\ ##0\")","v":"NOK 80 860"},null,{"$f":"Language!$C$11","v":"MØTETID MED KUNDE"},null,{"$f":"SUM(I17:I28)","v":4}]
[null,null,{"$f":"'Project estimate💰'!C16","v":"KPI workshop"},{"$f":"IF('Project estimate💰'!L16=0,\"0\",'Project estimate💰'!L16&\" \"&Duration)","v":"16 TIMER"},{"$f":"Currency&\" \"&TEXT('Project estimate💰'!P16,\"#\\ ##0\")","v":"NOK 24 880"},null,{"$f":"IF('Project estimate💰'!D16=0,\" \",'Project estimate💰'!G16*'Project estimate💰'!D16&\" \"& Duration)","v":"4 TIMER"},null,{"$f":"IF('Project estimate💰'!D16=0,\"0\",'Project estimate💰'!D16)","v":1}]
[null,null,{"$f":"'Project estimate💰'!C17","v":"Arbeidsflyt workshop"},{"$f":"IF('Project estimate💰'!L17=0,\"0\",'Project estimate💰'!L17&\" \"&Duration)","v":"20 TIMER"},{"$f":"Currency&\" \"&TEXT('Project estimate💰'!P17,\"#\\ ##0\")","v":"NOK 31 100"},null,{"$f":"IF('Project estimate💰'!D17=0,\" \",'Project estimate💰'!G17*'Project estimate💰'!D17&\" \"& Duration)","v":"4 TIMER"},null,{"$f":"IF('Project estimate💰'!D17=0,\"0\",'Project estimate💰'!D17)","v":1}]
[null,null,{"$f":"'Project estimate💰'!C18","v":"Konfigurasjonsworkshop"},{"$f":"IF('Project estimate💰'!L18=0,\"0\",'Project estimate💰'!L18&\" \"&Duration)","v":"12 TIMER"},{"$f":"Currency&\" \"&TEXT('Project estimate💰'!P18,\"#\\ ##0\")","v":"NOK 18 660"},null,{"$f":"IF('Project estimate💰'!D18=0,\" \",'Project estimate💰'!G18*'Project estimate💰'!D18&\" \"& Duration)","v":"4 TIMER"},null,{"$f":"IF('Project estimate💰'!D18=0,\"0\",'Project estimate💰'!D18)","v":1}]
[null,null,{"$f":"'Project estimate💰'!C19","v":"CRM Script spesifikasjon"},{"$f":"IF('Project estimate💰'!L19=0,\"0\",'Project estimate💰'!L19&\" \"&Duration)","v":"0"},{"$f":"Currency&\" \"&TEXT('Project estimate💰'!P19,\"#\\ ##0\")","v":"NOK  0"},null,{"$f":"IF('Project estimate💰'!D19=0,\" \",'Project estimate💰'!G19*'Project estimate💰'!D19&\" \"& Duration)","v":" "},null,{"$f":"IF('Project estimate💰'!D19=0,\"0\",'Project estimate💰'!D19)","v":"0"}]
{"$rows_left_out":48}
{"sheet":"Project estimate - Description","index":3,"n_rows":67,"n_cols":5,"rows_kept":67,"cut":false,"hidden":true,"merged":[]}
[]
[null,"PROJECT"]
[null,"BREAKDOWN"]
[]
[null,null,"IDENTIFY",{"$f":"IF('Project estimate💰'!J8=0,\"0\",'Project estimate💰'!J8&\" HOURS\")","v":"0"},{"$f":"Currency&\" \"&TEXT('Project estimate💰'!P8,\"#\\ ##0\")","v":"NOK  0"}]
[null,null,{"$f":"'Project estimate💰'!C5&CHAR(10)&'Project estimate💰'!S5","v":"Løsningsbeskrivelse\n0"},{"$f":"IF('Project estimate💰'!J5=0,\"0\",'Project estimate💰'!J5&\" HOURS\")","v":"0"},{"$f":"Currency&\" \"&TEXT('Project estimate💰'!P5,\"#\\ ##0\")","v":"NOK  0"}]
[null,null,{"$f":"'Project estimate💰'!C6&CHAR(10)&'Project estimate💰'!S6","v":"Custom activity\n"},{"$f":"IF('Project estimate💰'!J6=0,\"0\",'Project estimate💰'!J6&\" HOURS\")","v":"0"},{"$f":"Currency&\" \"&TEXT('Project estimate💰'!P6,\"#\\ ##0\")","v":"NOK  0"}]
[null,null,{"$f":"'Project estimate💰'!C7&CHAR(10)&'Project estimate💰'!S7","v":"Custom activity\n"},{"$f":"IF('Project estimate💰'!J7=0,\"0\",'Project estimate💰'!J7&\" HOURS\")","v":"0"},{"$f":"Currency&\" \"&TEXT('Project estimate💰'!P7,\"#\\ ##0\")","v":"NOK  0"}]
[]
[null,null,"INITIATE",{"$f":"IF('Project estimate💰'!J14=0,\"0\",'Project estimate💰'!J14&\" \"&Duration)","v":"2 TIMER"},{"$f":"Currency&\" \"&TEXT('Project estimate💰'!P14,\"#\\ ##0\")","v":"NOK 9 330"}]
[null,null,{"$f":"'Project estimate💰'!C10&CHAR(10)&'Project estimate💰'!S10","v":"Verdi workshop\nSkape enighet om hvorfor vi gjør dette og hvordan dette støtter strategien. Opparbeide en felles forståelse for og sterk forankring av prosjektets omfang og leveranser i ledergruppen. Kartlegge de 3-5 viktigste KPIer som forretningen navigerer og prioriterer etter."},{"$f":"IF('Project estimate💰'!J10=0,\"0\",'Project estimate💰'!J10&\" \"&Duration)","v":"0"},{"$f":"Currency&\" \"&TEXT('Project estimate💰'!P10,\"#\\ ##0\")","v":"NOK  0"}]
[null,null,{"$f":"'Project estimate💰'!C11&CHAR(10)&'Project estimate💰'!S11","v":"Kick-Off møte\nSkape felles forståelse av prosjektets omfang, leveranser og nøkkel KPI. Definere organisering av prosjektet og mobilisere kjerneteam.Forberede designfasen (Hva trenger vi fra de - hvem ønsker vi at skal delta)."},{"$f":"IF('Project estimate💰'!J11=0,\"0\",'Project estimate💰'!J11&\" \"&Duration)","v":"2 TIMER"},{"$f":"Currency&\" \"&TEXT('Project estimate💰'!P11,\"#\\ ##0\")","v":"NOK 9 330"}]
[null,null,{"$f":"'Project estimate💰'!C12&CHAR(10)&'Project estimate💰'!S12","v":"Custom activity\n"},{"$f":"IF('Project estimate💰'!J12=0,\"0\",'Project estimate💰'!J12&\" \"& Duration)","v":"0"},{"$f":"Currency&\" \"&TEXT('Project estimate💰'!P12,\"#\\ ##0\")","v":"NOK  0"}]
[null,null,{"$f":"'Project estimate💰'!C13&CHAR(10)&'Project estimate💰'!S13","v":"Custom activity\n"},{"$f":"IF('Project estimate💰'!J13=0,\"0\",'Project estimate💰'!J13&\" \"&Duration)","v":"0"},{"$f":"Currency&\" \"&TEXT('Project estimate💰'!P13,\"#\\ ##0\")","v":"NOK  0"}]
[]
[null,null,"DESIGN",{"$f":"IF('Project estimate💰'!J28=0,\"0\",'Project estimate💰'!J28&\" \"&Duration)","v":"24 TIMER"},{"$f":"Currency&\" \"&TEXT('Project estimate💰'!P28,\"#\\ ##0\")","v":"NOK 80 860"}]
[null,null,{"$f":"'Project estimate💰'!C16&CHAR(10)&'Project estimate💰'!S16","v":"KPI workshop\nOmsette de viktigste måleparameter til leading og lagging KPIer. Kvalifisere KPI, hvordan omsetter vi dette til SO og kan vi måle og følge opp dette. Hvilke dashboards trenger vi for å kunne omsette data til innsikt. Hvem er ansvarlig for datainnsamling, kvalifisering og SO hos kunden."},{"$f":"IF('Project estimate💰'!J16=0,\"0\",'Project estimate💰'!J16&\" \"&Duration)","v":"8 TIMER"},{"$f":"Currency&\" \"&TEXT('Project estimate💰'!P16,\"#\\ ##0\")","v":"NOK 24 880"}]
[null,null,{"$f":"'Project estimate💰'!C17&CHAR(10)&'Project estimate💰'!S17","v":"Arbeidsflyt workshop\nForberede designfasen (Hva trenger vi fra de - hvem ønsker vi at skal delta)."},{"$f":"IF('Project estimate💰'!J17=0,\"0\",'Project estimate💰'!J17&\" \"&Duration)","v":"8 TIMER"},{"$f":"Currency&\" \"&TEXT('Project estimate💰'!P17,\"#\\ ##0\")","v":"NOK 31 100"}]
[null,null,{"$f":"'Project estimate💰'!C18&CHAR(10)&'Project estimate💰'!S18","v":"Konfigurasjonsworkshop\nWorkshop med 2 konsulenter fasilitert digitalt via Miro eller fysisk etter Brown Paper metoden. Formålet med workshopen er å komme frem til en best mulig utforming og konfigurasjon for SuperOffice CRM. Vi fokuserer på at systemet må støtte forretningsprosessen (definert i Workflow workshop) og dekke behovet for brukerstøtte og rapportering i organisasjonen. Databasen konfigureres og alt dokumenteres."},{"$f":"IF('Project estimate💰'!J18=0,\"0\",'Project estimate💰'!J18&\" \"&Duration)","v":"4 TIMER"},{"$f":"Currency&\" \"&TEXT('Project estimate💰'!P18,\"#\\ ##0\")","v":"NOK 18 660"}]
[null,null,{"$f":"'Project estimate💰'!C19&CHAR(10)&'Project estimate💰'!S19","v":"CRM Script spesifikasjon\nFormålet med CRMScript-workshopen er at vi sammen avdekker deres behov for automatisering av prosesser, for å sikre datakvalitet og for spesialtilpassing av SuperOffice. Utvikling av script estimeres på bakgrunn av denne aktiviteten. "},{"$f":"IF('Project estimate💰'!J19=0,\"0\",'Project estimate💰'!J19&\" \"&Duration)","v":"0"},{"$f":"Currency&\" \"&TEXT('Project estimate💰'!P19,\"#\\ ##0\")","v":"NOK  0"}]
{"$rows_left_out":48}
{"sheet":"Language","index":4,"n_rows":67,"n_cols":18,"rows_kept":67,"cut":false,"hidden":true,"merged":[]}
[]
[null,"SETTINGS"]
[null,"LANGUAGE"]
[]
[null,"Select language",{"$f":"Frontpage🛠️!D12","v":"NO"}]
[]
[null,"Labels","Current language",null,"English","Norwegian","Swedish","Danish","German","Swizz","Dutch"]
[null,null,{"$f":"_xlfn.SWITCH(Language,\"EN\",E8,\"NO\",F8,\"SE\",G8,\"DK\",H8,\"DE\",I8,\"CH\",J8,\"NL\",K8,)","v":"TOTALT"},null,"TOTAL","TOTALT","TOTALT","I ALT","GESAMT","GESAMT","TOTAAL"]
[null,null,{"$f":"_xlfn.SWITCH(Language,\"EN\",E9,\"NO\",F9,\"SE\",G9,\"DK\",H9,\"DE\",I9,\"CH\",J9,\"NL\",K9,)","v":"TIMER"},null,"HOURS","TIMER","TIMMAR","TIMER","STUNDEN","STUNDEN","UUR"]
[null,null,{"$f":"_xlfn.SWITCH(Language,\"EN\",E10,\"NO\",F10,\"SE\",G10,\"DK\",H10,\"DE\",I10,\"CH\",J10,\"NL\",K10,)","v":"Ukjent"},null,"Unknown","Ukjent","Okänt","Ukendt","Unbekannt","Unbekannt","Onbekend"]
[null,null,{"$f":"_xlfn.SWITCH(Language,\"EN\",E11,\"NO\",F11,\"SE\",G11,\"DK\",H11,\"DE\",I11,\"CH\",J11,\"NL\",K11,)","v":"MØTETID MED KUNDE"},null,"TIME WITH CUSTOMER","MØTETID MED KUNDE","TID MED KUNDEN","TID HOS KUNDEN","ZEIT BEIM KUNDEN","ZEIT BEIM KUNDEN","TIJD MET KLANT"]
[null,null,{"$f":"_xlfn.SWITCH(Language,\"EN\",E12,\"NO\",F12,\"SE\",G12,\"DK\",H12,\"DE\",I12,\"CH\",J12,\"NL\",K12,)","v":"Gjennomføringer"},null,"Executions","Gjennomføringer","Utföranden","Udførelser","Durchführung","Durchführung","Uitvoeringen"]
[null,null,{"$f":"_xlfn.SWITCH(Language,\"EN\",E13,\"NO\",F13,\"SE\",G13,\"DK\",H13,\"DE\",I13,\"CH\",J13,\"NL\",K13,)","v":"Konsulenter"},null,"Consultants","Konsulenter","Konsulter","Konsulenter","Berater","Berater","Consultants"]
[null,null,{"$f":"_xlfn.SWITCH(Language,\"EN\",E14,\"NO\",F14,\"SE\",G14,\"DK\",H14,\"DE\",I14,\"CH\",J14,\"NL\",K14,)","v":"Forberedelser"},null,"Preparations","Forberedelser","Förberedelser","Forberedelser","Vorbereitungen","Vorbereitungen","Voorbereidingen"]
[null,null,{"$f":"_xlfn.SWITCH(Language,\"EN\",E15,\"NO\",F15,\"SE\",G15,\"DK\",H15,\"DE\",I15,\"CH\",J15,\"NL\",K15,)","v":"Gjennomføring"},null,"Execution","Gjennomføring","Utförande","Udførelse","Durchführung","Durchführung","Uitvoering"]
[null,null,{"$f":"_xlfn.SWITCH(Language,\"EN\",E16,\"NO\",F16,\"SE\",G16,\"DK\",H16,\"DE\",I16,\"CH\",J16,\"NL\",K16,)","v":"Etterarbeid"},null,"Follow up","Etterarbeid","Uppföljning","Opfølgning","Nachfassen","Nachfassen","Vervolgactiviteit"]
[null,null,{"$f":"_xlfn.SWITCH(Language,\"EN\",E17,\"NO\",F17,\"SE\",G17,\"DK\",H17,\"DE\",I17,\"CH\",J17,\"NL\",K17,)","v":"Forberedelser - Total"},null,"Preparations - Total","Forberedelser - Total","Förberedelser - Totalt","Forberedelser – i alt","Vorbereitungen – gesamt","Vorbereitungen – gesamt","Voorbereidingen - Totaal"]
[null,null,{"$f":"_xlfn.SWITCH(Language,\"EN\",E18,\"NO\",F18,\"SE\",G18,\"DK\",H18,\"DE\",I18,\"CH\",J18,\"NL\",K18,)","v":"Gjennomføring - Total"},null,"Execution - Total","Gjennomføring - Total","Utförande - Totalt","Udførelse – i alt","Durchführung – gesamt","Durchführung – gesamt","Uitvoering - Totaal"]
[null,null,{"$f":"_xlfn.SWITCH(Language,\"EN\",E19,\"NO\",F19,\"SE\",G19,\"DK\",H19,\"DE\",I19,\"CH\",J19,\"NL\",K19,)","v":"Etterarbeid - Total"},null,"Follow up - Total","Etterarbeid - Total","Uppföljning - Totalt","Opfølgning – i alt","Nachfassen – gesamt","Nachfassen – gesamt","Vervolgactiviteit - Totaal"]
[null,null,{"$f":"_xlfn.SWITCH(Language,\"EN\",E20,\"NO\",F20,\"SE\",G20,\"DK\",H20,\"DE\",I20,\"CH\",J20,\"NL\",K20,)","v":"Tid - Total"},null,"Time - Total","Tid - Total","Tid - Totalt","Tid – i alt","Zeit – gesamt","Zeit – gesamt","Tijd - Totaal"]
{"$rows_left_out":48}
{"sheet":"Currency","index":5,"n_rows":26,"n_cols":10,"rows_kept":26,"cut":false,"hidden":true,"merged":[]}
[]
[null,"SETTINGS"]
[null,"CURRENCY"]
[null,"Choose country",{"$f":"Country","v":"Norway"}]
[null,"Base estimates on","Hour rate"]
[]
[null,"Consultancy tariffs","Set rate","Set currency"]
[null,"Price per hour",{"$f":"IF(RateType=\"Normal\",_xlfn.SWITCH(Country,\"Benelux\",IF(C5=\"Day rate\",C12/8,D12),\"Germany\",IF(C5=\"Day rate\",C13/8,D13),\"Denmark\",IF(C5=\"Day rate\",C14/8,D14),\"Norway\",IF(C5=\"Day rate\",C15/8,D15),\"Sweden\",IF(C5=\"Day rate\",C16/8,D16),\"Switzerland\",IF(C5=\"Day rate\",C17/8,D17),\"United Kingdom\",IF(C5=\"Day rate\",C18/8,D18)),_xlfn.SWITCH(Country,\"Benelux\",IF(C5=\"Day rate\",E12/8,F12),\"Germany\",IF(C5=\"Day rate\",E13/8,F13),\"Denmark\",IF(C5=\"Day rate\",E14/8,F14),\"Norway\",IF(C5=\"Day rate\",E15/8,F15),\"Sweden\",IF(C5=\"Day rate\",E16/8,F16),\"Switzerland\",IF(C5=\"Day rate\",E17/8,F17),\"United Kingdom\",IF(C5=\"Day rate\",E18/8,F18)))","v":1555},{"$f":"_xlfn.SWITCH(Country,\"Benelux\",G12,\"Germany\",G13,\"Denmark\",G14,\"Norway\",G15,\"Sweden\",G16,\"Switzerland\",G17,\"United Kingdom\",G18)","v":"NOK"}]
[]
[]
[null,"Consultancy rates","Normal day rate","Normal hour rate","Senior day rate","Senior hour rate","Currency"]
[null,"Benelux",1160,{"$f":"C12/8","v":145},null,null,"EUR"]
[null,"Germany",1325,{"$f":"C13/8","v":165.625},null,null,"EUR"]
[null,"Denmark",12000,1500,null,null,"DKK"]
[null,"Norway",12440,1555,13520,{"$f":"E15/8","v":1690},"NOK"]
[null,"Sweden",11600,1450,null,null,"SEK"]
[null,"Switzerland",1800,225,null,null,"CHF"]
[null,"United Kingdom",990,123.75,null,null,"GBP"]
[]
[]
{"$rows_left_out":6}